substack/ndarray-linear-solve

2014-06-07 02:09:55
npm http GET https://registry.npmjs.org/browserify npm http 200 https://registry.npmjs.org/browserify npm http GET https://registry.npmjs.org/browserify/-/browserify-4.1.8.tgz npm http 200 https://registry.npmjs.org/browserify/-/browserify-4.1.8.tgz npm http GET https://registry.npmjs.org/browser-pack npm http GET https://registry.npmjs.org/assert npm http GET https://registry.npmjs.org/browser-resolve npm http GET https://registry.npmjs.org/browserify-zlib npm http GET https://registry.npmjs.org/buffer npm http GET https://registry.npmjs.org/builtins npm http GET https://registry.npmjs.org/commondir/0.0.1 npm http GET https://registry.npmjs.org/concat-stream npm http GET https://registry.npmjs.org/console-browserify npm http GET https://registry.npmjs.org/constants-browserify npm http GET https://registry.npmjs.org/crypto-browserify npm http GET https://registry.npmjs.org/deep-equal npm http GET https://registry.npmjs.org/defined npm http GET https://registry.npmjs.org/deps-sort npm http GET https://registry.npmjs.org/derequire npm http GET https://registry.npmjs.org/domain-browser npm http GET https://registry.npmjs.org/duplexer npm http GET https://registry.npmjs.org/events npm http GET https://registry.npmjs.org/glob npm http GET https://registry.npmjs.org/http-browserify npm http GET https://registry.npmjs.org/https-browserify npm http GET https://registry.npmjs.org/inherits npm http GET https://registry.npmjs.org/insert-module-globals npm http GET https://registry.npmjs.org/module-deps npm http GET https://registry.npmjs.org/os-browserify npm http GET https://registry.npmjs.org/parents npm http GET https://registry.npmjs.org/path-browserify npm http GET https://registry.npmjs.org/punycode npm http GET https://registry.npmjs.org/querystring-es3 npm http GET https://registry.npmjs.org/readable-stream npm http GET https://registry.npmjs.org/resolve npm http GET https://registry.npmjs.org/shallow-copy/0.0.1 npm http GET https://registry.npmjs.org/shell-quote npm http GET https://registry.npmjs.org/stream-browserify npm http GET https://registry.npmjs.org/stream-combiner npm http GET https://registry.npmjs.org/string_decoder npm http GET https://registry.npmjs.org/subarg/0.0.1 npm http GET https://registry.npmjs.org/syntax-error npm http GET https://registry.npmjs.org/through2 npm http GET https://registry.npmjs.org/timers-browserify npm http GET https://registry.npmjs.org/tty-browserify npm http GET https://registry.npmjs.org/umd npm http GET https://registry.npmjs.org/url npm http GET https://registry.npmjs.org/util npm http GET https://registry.npmjs.org/vm-browserify npm http GET https://registry.npmjs.org/xtend npm http GET https://registry.npmjs.org/process npm http GET https://registry.npmjs.org/JSONStream npm http 200 https://registry.npmjs.org/browser-resolve npm http 200 https://registry.npmjs.org/browserify-zlib npm http 200 https://registry.npmjs.org/browser-pack npm http GET https://registry.npmjs.org/browser-resolve/-/browser-resolve-1.2.4.tgz npm http GET https://registry.npmjs.org/browserify-zlib/-/browserify-zlib-0.1.4.tgz npm http GET https://registry.npmjs.org/browser-pack/-/browser-pack-2.0.1.tgz npm http 200 https://registry.npmjs.org/browser-resolve/-/browser-resolve-1.2.4.tgz npm http 200 https://registry.npmjs.org/assert npm http 200 https://registry.npmjs.org/buffer npm http 200 https://registry.npmjs.org/browser-pack/-/browser-pack-2.0.1.tgz npm http 200 https://registry.npmjs.org/console-browserify npm ERR! registry error parsing json npm http 200 https://registry.npmjs.org/concat-stream npm http 200 https://registry.npmjs.org/builtins npm http GET https://registry.npmjs.org/assert/-/assert-1.1.1.tgz npm http GET https://registry.npmjs.org/buffer/-/buffer-2.3.2.tgz npm http 200 https://registry.npmjs.org/deep-equal npm http 200 https://registry.npmjs.org/commondir/0.0.1 npm http 200 https://registry.npmjs.org/constants-browserify npm http GET https://registry.npmjs.org/concat-stream/-/concat-stream-1.4.6.tgz npm http 200 https://registry.npmjs.org/assert/-/assert-1.1.1.tgz npm http 200 https://registry.npmjs.org/buffer/-/buffer-2.3.2.tgz npm http 200 https://registry.npmjs.org/defined npm http 200 https://registry.npmjs.org/browserify-zlib/-/browserify-zlib-0.1.4.tgz npm http GET https://registry.npmjs.org/builtins/-/builtins-0.0.4.tgz npm http 200 https://registry.npmjs.org/concat-stream/-/concat-stream-1.4.6.tgz npm http 200 https://registry.npmjs.org/crypto-browserify npm ERR! SyntaxError: Unexpected token < npm ERR! npm ERR! <?xml version="1.0" encoding="utf-8"?> npm ERR! <!DOCTYPE html PUBLIC "-//W3C//DTD XHTML 1.0 Strict//EN" npm ERR! "http://www.w3.org/TR/xhtml1/DTD/xhtml1-strict.dtd"> npm ERR! <html> npm ERR! <head> npm ERR! <title>200 OK</title> npm ERR! </head> npm ERR! <body> npm ERR! <h1>Error 200 OK</h1> npm ERR! <p>OK</p> npm ERR! <h3>Guru Meditation:</h3> npm ERR! <p>XID: 724829549</p> npm ERR! <hr> npm ERR! <p>Varnish cache server</p> npm ERR! </body> npm ERR! </html> npm ERR! npm ERR! at Object.parse (native) npm ERR! at RegClient.<anonymous> (/testling/bin/node-v0.10.24/lib/node_modules/npm/node_modules/npm-registry-client/lib/request.js:241:23) npm ERR! at Request.self.callback (/testling/bin/node-v0.10.24/lib/node_modules/npm/node_modules/request/request.js:123:22) npm ERR! at Request.EventEmitter.emit (events.js:98:17) npm ERR! at Request.<anonymous> (/testling/bin/node-v0.10.24/lib/node_modules/npm/node_modules/request/request.js:893:14) npm ERR! at Request.EventEmitter.emit (events.js:117:20) npm ERR! at IncomingMessage.<anonymous> (/testling/bin/node-v0.10.24/lib/node_modules/npm/node_modules/request/request.js:844:12) npm ERR! at IncomingMessage.EventEmitter.emit (events.js:117:20) npm ERR! at _stream_readable.js:920:16 npm ERR! at process._tickCallback (node.js:415:13) npm ERR! If you need help, you may report this *entire* log, npm ERR! including the npm and node versions, at: npm ERR! <http://github.com/isaacs/npm/issues> npm ERR! System Linux 2.6.35.4-rscloud npm ERR! command "/testling/bin/node-v0.10.24/bin/node" "/testling/bin/node-v0.10.24/bin/npm" "--cache=/home/substack/.npm/eb8a5frbl0xr8rxw" "install" "browserify" npm ERR! cwd /home/substack/repos/747aebbd12573f31fbc4dbd286abcbf2046546d5.1402103394909 npm ERR! node -v v0.10.24 npm ERR! npm -v 1.3.21 npm ERR! type unexpected_token npm http GET https://registry.npmjs.org/deep-equal/-/deep-equal-0.1.2.tgz npm http 200 https://registry.npmjs.org/builtins/-/builtins-0.0.4.tgz npm http GET https://registry.npmjs.org/constants-browserify/-/constants-browserify-0.0.1.tgz npm http 200 https://registry.npmjs.org/derequire npm http GET https://registry.npmjs.org/commondir/-/commondir-0.0.1.tgz npm http 200 https://registry.npmjs.org/deps-sort npm http GET https://registry.npmjs.org/defined/-/defined-0.0.0.tgz npm http 200 https://registry.npmjs.org/domain-browser npm http 200 https://registry.npmjs.org/events npm http 200 https://registry.npmjs.org/duplexer npm http 200 https://registry.npmjs.org/constants-browserify/-/constants-browserify-0.0.1.tgz npm http 200 https://registry.npmjs.org/deep-equal/-/deep-equal-0.1.2.tgz npm http 200 https://registry.npmjs.org/commondir/-/commondir-0.0.1.tgz npm http GET https://registry.npmjs.org/crypto-browserify/-/crypto-browserify-1.0.9.tgz npm http 200 https://registry.npmjs.org/defined/-/defined-0.0.0.tgz npm http GET https://registry.npmjs.org/derequire/-/derequire-0.8.0.tgz npm http GET https://registry.npmjs.org/deps-sort/-/deps-sort-0.1.2.tgz npm http GET https://registry.npmjs.org/domain-browser/-/domain-browser-1.1.1.tgz npm http 200 https://registry.npmjs.org/glob npm http GET https://registry.npmjs.org/events/-/events-1.0.1.tgz npm http GET https://registry.npmjs.org/duplexer/-/duplexer-0.1.1.tgz npm http 200 https://registry.npmjs.org/derequire/-/derequire-0.8.0.tgz npm http 200 https://registry.npmjs.org/inherits npm http 200 https://registry.npmjs.org/https-browserify npm http 200 https://registry.npmjs.org/domain-browser/-/domain-browser-1.1.1.tgz npm http 200 https://registry.npmjs.org/http-browserify npm http 200 https://registry.npmjs.org/crypto-browserify/-/crypto-browserify-1.0.9.tgz npm http 200 https://registry.npmjs.org/events/-/events-1.0.1.tgz npm http GET https://registry.npmjs.org/glob/-/glob-3.2.11.tgz npm http 200 https://registry.npmjs.org/os-browserify npm http GET https://registry.npmjs.org/inherits/-/inherits-2.0.1.tgz npm http 200 https://registry.npmjs.org/duplexer/-/duplexer-0.1.1.tgz npm http 200 https://registry.npmjs.org/deps-sort/-/deps-sort-0.1.2.tgz npm http 200 https://registry.npmjs.org/insert-module-globals npm http GET https://registry.npmjs.org/https-browserify/-/https-browserify-0.0.0.tgz npm http 200 https://registry.npmjs.org/path-browserify npm http 200 https://registry.npmjs.org/glob/-/glob-3.2.11.tgz npm http GET https://registry.npmjs.org/http-browserify/-/http-browserify-1.3.2.tgz npm http 200 https://registry.npmjs.org/parents npm http 200 https://registry.npmjs.org/inherits/-/inherits-2.0.1.tgz npm http GET https://registry.npmjs.org/os-browserify/-/os-browserify-0.1.2.tgz npm http 200 https://registry.npmjs.org/querystring-es3 npm http 200 https://registry.npmjs.org/https-browserify/-/https-browserify-0.0.0.tgz npm http GET https://registry.npmjs.org/insert-module-globals/-/insert-module-globals-6.0.0.tgz npm http 200 https://registry.npmjs.org/http-browserify/-/http-browserify-1.3.2.tgz npm http 200 https://registry.npmjs.org/os-browserify/-/os-browserify-0.1.2.tgz npm http GET https://registry.npmjs.org/path-browserify/-/path-browserify-0.0.0.tgz npm http 200 https://registry.npmjs.org/punycode npm http GET https://registry.npmjs.org/parents/-/parents-0.0.2.tgz npm http 200 https://registry.npmjs.org/insert-module-globals/-/insert-module-globals-6.0.0.tgz npm http 200 https://registry.npmjs.org/shallow-copy/0.0.1 npm http 200 https://registry.npmjs.org/path-browserify/-/path-browserify-0.0.0.tgz npm http GET https://registry.npmjs.org/querystring-es3/-/querystring-es3-0.2.1-0.tgz npm http 200 https://registry.npmjs.org/readable-stream npm http 200 https://registry.npmjs.org/parents/-/parents-0.0.2.tgz npm http 200 https://registry.npmjs.org/resolve npm http GET https://registry.npmjs.org/punycode/-/punycode-1.2.4.tgz npm http 200 https://registry.npmjs.org/querystring-es3/-/querystring-es3-0.2.1-0.tgz npm http 200 https://registry.npmjs.org/stream-browserify npm http GET https://registry.npmjs.org/shallow-copy/-/shallow-copy-0.0.1.tgz npm http 200 https://registry.npmjs.org/string_decoder npm http 200 https://registry.npmjs.org/punycode/-/punycode-1.2.4.tgz npm http 200 https://registry.npmjs.org/stream-combiner npm http GET https://registry.npmjs.org/readable-stream/-/readable-stream-1.0.27-1.tgz npm http 200 https://registry.npmjs.org/module-deps npm http 200 https://registry.npmjs.org/shallow-copy/-/shallow-copy-0.0.1.tgz npm http GET https://registry.npmjs.org/resolve/-/resolve-0.6.3.tgz npm http GET https://registry.npmjs.org/stream-browserify/-/stream-browserify-1.0.0.tgz npm http 200 https://registry.npmjs.org/readable-stream/-/readable-stream-1.0.27-1.tgz npm http 200 https://registry.npmjs.org/syntax-error npm http 200 https://registry.npmjs.org/subarg/0.0.1 npm http 200 https://registry.npmjs.org/through2 npm http 200 https://registry.npmjs.org/resolve/-/resolve-0.6.3.tgz npm http GET https://registry.npmjs.org/string_decoder/-/string_decoder-0.0.1.tgz npm http GET https://registry.npmjs.org/stream-combiner/-/stream-combiner-0.0.4.tgz npm http 200 https://registry.npmjs.org/shell-quote npm http 200 https://registry.npmjs.org/stream-browserify/-/stream-browserify-1.0.0.tgz npm http GET https://registry.npmjs.org/module-deps/-/module-deps-2.1.2.tgz npm http 200 https://registry.npmjs.org/timers-browserify npm http 200 https://registry.npmjs.org/tty-browserify npm http 200 https://registry.npmjs.org/string_decoder/-/string_decoder-0.0.1.tgz npm http 200 https://registry.npmjs.org/url npm http 200 https://registry.npmjs.org/stream-combiner/-/stream-combiner-0.0.4.tgz npm http GET https://registry.npmjs.org/syntax-error/-/syntax-error-1.1.0.tgz npm http 200 https://registry.npmjs.org/module-deps/-/module-deps-2.1.2.tgz npm http 200 https://registry.npmjs.org/umd npm http GET https://registry.npmjs.org/through2/-/through2-0.4.2.tgz npm http GET https://registry.npmjs.org/subarg/-/subarg-0.0.1.tgz npm http 200 https://registry.npmjs.org/util npm http GET https://registry.npmjs.org/shell-quote/-/shell-quote-0.0.1.tgz npm http 200 https://registry.npmjs.org/vm-browserify npm http GET https://registry.npmjs.org/timers-browserify/-/timers-browserify-1.0.1.tgz npm http GET https://registry.npmjs.org/tty-browserify/-/tty-browserify-0.0.0.tgz npm http 200 https://registry.npmjs.org/through2/-/through2-0.4.2.tgz npm http 200 https://registry.npmjs.org/xtend npm http GET https://registry.npmjs.org/url/-/url-0.10.1.tgz npm http 200 https://registry.npmjs.org/subarg/-/subarg-0.0.1.tgz npm http 200 https://registry.npmjs.org/timers-browserify/-/timers-browserify-1.0.1.tgz npm http 200 https://registry.npmjs.org/process npm http 200 https://registry.npmjs.org/tty-browserify/-/tty-browserify-0.0.0.tgz npm http 200 https://registry.npmjs.org/url/-/url-0.10.1.tgz npm http GET https://registry.npmjs.org/umd/-/umd-2.1.0.tgz npm http GET https://registry.npmjs.org/util/-/util-0.10.3.tgz npm http GET https://registry.npmjs.org/vm-browserify/-/vm-browserify-0.0.4.tgz npm http 200 https://registry.npmjs.org/umd/-/umd-2.1.0.tgz npm http 200 https://registry.npmjs.org/JSONStream npm http GET https://registry.npmjs.org/xtend/-/xtend-3.0.0.tgz npm http 200 https://registry.npmjs.org/shell-quote/-/shell-quote-0.0.1.tgz npm http 200 https://registry.npmjs.org/util/-/util-0.10.3.tgz npm http GET https://registry.npmjs.org/process/-/process-0.7.0.tgz npm http 200 https://registry.npmjs.org/vm-browserify/-/vm-browserify-0.0.4.tgz npm http 200 https://registry.npmjs.org/xtend/-/xtend-3.0.0.tgz npm http 200 https://registry.npmjs.org/process/-/process-0.7.0.tgz npm http 200 https://registry.npmjs.org/syntax-error/-/syntax-error-1.1.0.tgz npm http GET https://registry.npmjs.org/JSONStream/-/JSONStream-0.7.4.tgz npm http 200 https://registry.npmjs.org/JSONStream/-/JSONStream-0.7.4.tgz npm ERR! npm ERR! Additional logging details can be found in: npm ERR! /home/substack/repos/747aebbd12573f31fbc4dbd286abcbf2046546d5.1402103394909/npm-debug.log npm ERR! not ok code 0 npm http GET https://registry.npmjs.org/ndarray-scratch npm http GET https://registry.npmjs.org/ndarray-lu-solve npm http GET https://registry.npmjs.org/tape npm http GET https://registry.npmjs.org/ndarray-show npm http GET https://registry.npmjs.org/ndarray npm http GET https://registry.npmjs.org/ndarray-crout-decomposition npm http 200 https://registry.npmjs.org/tape npm http 200 https://registry.npmjs.org/ndarray-lu-solve npm http 200 https://registry.npmjs.org/ndarray-show npm http GET https://registry.npmjs.org/tape/-/tape-2.12.3.tgz npm http 200 https://registry.npmjs.org/ndarray npm http 200 https://registry.npmjs.org/ndarray-scratch npm http GET https://registry.npmjs.org/ndarray-lu-solve/-/ndarray-lu-solve-1.1.0.tgz npm http GET https://registry.npmjs.org/ndarray-show/-/ndarray-show-1.1.0.tgz npm http GET https://registry.npmjs.org/ndarray/-/ndarray-1.0.15.tgz npm http GET https://registry.npmjs.org/ndarray-scratch/-/ndarray-scratch-1.1.1.tgz npm http 200 https://registry.npmjs.org/ndarray-crout-decomposition npm http GET https://registry.npmjs.org/ndarray-crout-decomposition/-/ndarray-crout-decomposition-1.1.0.tgz npm http 200 https://registry.npmjs.org/ndarray/-/ndarray-1.0.15.tgz npm http 200 https://registry.npmjs.org/ndarray-lu-solve/-/ndarray-lu-solve-1.1.0.tgz npm http 200 https://registry.npmjs.org/ndarray-crout-decomposition/-/ndarray-crout-decomposition-1.1.0.tgz npm http 200 https://registry.npmjs.org/ndarray-scratch/-/ndarray-scratch-1.1.1.tgz npm http 200 https://registry.npmjs.org/tape/-/tape-2.12.3.tgz npm http 200 https://registry.npmjs.org/ndarray-show/-/ndarray-show-1.1.0.tgz npm http GET https://registry.npmjs.org/typedarray-pool npm http GET https://registry.npmjs.org/ndarray-ops npm http GET https://registry.npmjs.org/iota-array npm http GET https://registry.npmjs.org/fixed-width-float npm http 200 https://registry.npmjs.org/ndarray-ops npm http GET https://registry.npmjs.org/ndarray-ops/-/ndarray-ops-1.2.2.tgz npm http 200 https://registry.npmjs.org/ndarray-ops/-/ndarray-ops-1.2.2.tgz npm http 200 https://registry.npmjs.org/iota-array npm http GET https://registry.npmjs.org/iota-array/-/iota-array-1.0.0.tgz npm http 200 https://registry.npmjs.org/typedarray-pool npm http GET https://registry.npmjs.org/typedarray-pool/-/typedarray-pool-1.0.2.tgz npm http 200 https://registry.npmjs.org/iota-array/-/iota-array-1.0.0.tgz npm http 200 https://registry.npmjs.org/typedarray-pool/-/typedarray-pool-1.0.2.tgz npm http 200 https://registry.npmjs.org/fixed-width-float npm http GET https://registry.npmjs.org/fixed-width-float/-/fixed-width-float-1.0.0.tgz npm http 200 https://registry.npmjs.org/fixed-width-float/-/fixed-width-float-1.0.0.tgz npm http GET https://registry.npmjs.org/object-inspect npm http GET https://registry.npmjs.org/resumer npm http GET https://registry.npmjs.org/through npm http GET https://registry.npmjs.org/deep-equal/-/deep-equal-0.2.1.tgz npm http 200 https://registry.npmjs.org/deep-equal/-/deep-equal-0.2.1.tgz npm http 200 https://registry.npmjs.org/through npm http GET https://registry.npmjs.org/through/-/through-2.3.4.tgz npm http 200 https://registry.npmjs.org/resumer npm http 200 https://registry.npmjs.org/object-inspect npm http GET https://registry.npmjs.org/resumer/-/resumer-0.0.0.tgz npm http GET https://registry.npmjs.org/object-inspect/-/object-inspect-0.4.0.tgz npm http 200 https://registry.npmjs.org/through/-/through-2.3.4.tgz npm http 200 https://registry.npmjs.org/resumer/-/resumer-0.0.0.tgz npm http 200 https://registry.npmjs.org/object-inspect/-/object-inspect-0.4.0.tgz npm http GET https://registry.npmjs.org/cwise-compiler npm http GET https://registry.npmjs.org/bit-twiddle npm http GET https://registry.npmjs.org/dup npm http 200 https://registry.npmjs.org/cwise-compiler npm http 200 https://registry.npmjs.org/bit-twiddle npm http GET https://registry.npmjs.org/cwise-compiler/-/cwise-compiler-1.0.0.tgz npm http GET https://registry.npmjs.org/bit-twiddle/-/bit-twiddle-1.0.2.tgz npm http 200 https://registry.npmjs.org/cwise-compiler/-/cwise-compiler-1.0.0.tgz npm http 200 https://registry.npmjs.org/dup npm http GET https://registry.npmjs.org/dup/-/dup-1.0.0.tgz npm http GET https://registry.npmjs.org/sprintf npm http 200 https://registry.npmjs.org/bit-twiddle/-/bit-twiddle-1.0.2.tgz npm http 200 https://registry.npmjs.org/sprintf npm http GET https://registry.npmjs.org/sprintf/-/sprintf-0.1.3.tgz npm http 200 https://registry.npmjs.org/dup/-/dup-1.0.0.tgz npm http 200 https://registry.npmjs.org/sprintf/-/sprintf-0.1.3.tgz npm http GET https://registry.npmjs.org/uniq npm http 200 https://registry.npmjs.org/uniq npm http GET https://registry.npmjs.org/uniq/-/uniq-1.0.1.tgz npm http GET https://registry.npmjs.org/minimatch npm http 200 https://registry.npmjs.org/uniq/-/uniq-1.0.1.tgz npm http 200 https://registry.npmjs.org/minimatch npm http GET https://registry.npmjs.org/minimatch/-/minimatch-0.3.0.tgz npm http 200 https://registry.npmjs.org/minimatch/-/minimatch-0.3.0.tgz npm http GET https://registry.npmjs.org/lru-cache npm http GET https://registry.npmjs.org/sigmund npm http 200 https://registry.npmjs.org/lru-cache npm http 200 https://registry.npmjs.org/sigmund npm http GET https://registry.npmjs.org/lru-cache/-/lru-cache-2.5.0.tgz npm http GET https://registry.npmjs.org/sigmund/-/sigmund-1.0.0.tgz npm http 200 https://registry.npmjs.org/lru-cache/-/lru-cache-2.5.0.tgz npm http 200 https://registry.npmjs.org/sigmund/-/sigmund-1.0.0.tgz ndarray-lu-solve@1.1.0 node_modules/ndarray-lu-solve ndarray-crout-decomposition@1.1.0 node_modules/ndarray-crout-decomposition ndarray@1.0.15 node_modules/ndarray └── iota-array@1.0.0 ndarray-show@1.1.0 node_modules/ndarray-show └── fixed-width-float@1.0.0 (sprintf@0.1.3) ndarray-scratch@1.1.1 node_modules/ndarray-scratch ├── typedarray-pool@1.0.2 (dup@1.0.0, bit-twiddle@1.0.2) └── ndarray-ops@1.2.2 (cwise-compiler@1.0.0) tape@2.12.3 node_modules/tape ├── inherits@2.0.1 ├── defined@0.0.0 ├── resumer@0.0.0 ├── deep-equal@0.2.1 ├── through@2.3.4 ├── object-inspect@0.4.0 └── glob@3.2.11 (minimatch@0.3.0) timeout: failed to run command 'browserify': No such file or directory * preprocessing command exit code 127 *
2014-06-07 02:08:35
2014-05-30 18:12:07
8.0
9.0
✓10.0
✓15.0
✓29.0
✓canary
✓15.0
✓24.0
✓nightly
5.1
6.0
✓12.0
✓15.0
✓next
6.0
6.0
4.2
not ok 1 Error: TypeError: 'undefined' is not a function
TAP version 13 # known solutions ok 1 (unnamed assert) ok 2 should be equal ok 3 (unnamed assert) ok 4 should be equal # 3x3 ok 5 (unnamed assert) ok 6 should be equivalent ok 7 (unnamed assert) ok 8 should be equivalent ok 9 (unnamed assert) ok 10 should be equivalent 1..10 # tests 10 # pass 10 # ok
TAP version 13 # known solutions ok 1 (unnamed assert) ok 2 should be equal ok 3 (unnamed assert) ok 4 should be equal # 3x3 ok 5 (unnamed assert) ok 6 should be equivalent ok 7 (unnamed assert) ok 8 should be equivalent ok 9 (unnamed assert) ok 10 should be equivalent 1..10 # tests 10 # pass 10 # ok
TAP version 13 # known solutions ok 1 (unnamed assert) ok 2 should be equal ok 3 (unnamed assert) ok 4 should be equal # 3x3 ok 5 (unnamed assert) ok 6 should be equivalent ok 7 (unnamed assert) ok 8 should be equivalent ok 9 (unnamed assert) ok 10 should be equivalent 1..10 # tests 10 # pass 10 # ok
TAP version 13 # known solutions ok 1 (unnamed assert) ok 2 should be equal ok 3 (unnamed assert) ok 4 should be equal # 3x3 ok 5 (unnamed assert) ok 6 should be equivalent ok 7 (unnamed assert) ok 8 should be equivalent ok 9 (unnamed assert) ok 10 should be equivalent 1..10 # tests 10 # pass 10 # ok
TAP version 13 # known solutions ok 1 (unnamed assert) ok 2 should be equal ok 3 (unnamed assert) ok 4 should be equal # 3x3 ok 5 (unnamed assert) ok 6 should be equivalent ok 7 (unnamed assert) ok 8 should be equivalent ok 9 (unnamed assert) ok 10 should be equivalent 1..10 # tests 10 # pass 10 # ok
TAP version 13 # known solutions ok 1 (unnamed assert) ok 2 should be equal ok 3 (unnamed assert) ok 4 should be equal # 3x3 ok 5 (unnamed assert) ok 6 should be equivalent ok 7 (unnamed assert) ok 8 should be equivalent ok 9 (unnamed assert) ok 10 should be equivalent 1..10 # tests 10 # pass 10 # ok
firefox/nightly
TAP version 13 # known solutions ok 1 (unnamed assert) ok 2 should be equal ok 3 (unnamed assert) ok 4 should be equal # 3x3 ok 5 (unnamed assert) ok 6 should be equivalent ok 7 (unnamed assert) ok 8 should be equivalent ok 9 (unnamed assert) ok 10 should be equivalent 1..10 # tests 10 # pass 10 # ok
TAP version 13 # known solutions ok 1 (unnamed assert) ok 2 should be equal ok 3 (unnamed assert) ok 4 should be equal # 3x3 ok 5 (unnamed assert) ok 6 should be equivalent ok 7 (unnamed assert) ok 8 should be equivalent ok 9 (unnamed assert) ok 10 should be equivalent 1..10 # tests 10 # pass 10 # ok
TAP version 13 # known solutions ok 1 (unnamed assert) ok 2 should be equal ok 3 (unnamed assert) ok 4 should be equal # 3x3 ok 5 (unnamed assert) ok 6 should be equivalent ok 7 (unnamed assert) ok 8 should be equivalent ok 9 (unnamed assert) ok 10 should be equivalent 1..10 # tests 10 # pass 10 # ok
TAP version 13 # known solutions ok 1 (unnamed assert) ok 2 should be equal ok 3 (unnamed assert) ok 4 should be equal # 3x3 ok 5 (unnamed assert) ok 6 should be equivalent ok 7 (unnamed assert) ok 8 should be equivalent ok 9 (unnamed assert) ok 10 should be equivalent 1..10 # tests 10 # pass 10 # ok
TAP version 13 # known solutions not ok 1 ReferenceError: 'Float64Array' is undefined --- operator: error expected: undefined actual: { description: '\'Float64Array\' is undefined', message: '\'Float64Array\' is undefined', number: -2146823279 } ... # 3x3 not ok 2 ReferenceError: 'Float64Array' is undefined --- operator: error expected: undefined actual: { description: '\'Float64Array\' is undefined', message: '\'Float64Array\' is undefined', number: -2146823279 } ... not ok 3 plan != count --- operator: fail expected: 6 actual: 1 ... 1..3 # tests 3 # pass 0 # fail 3
not ok 1 Error: Object doesn't support this property or method on line 5774
2014-05-30 03:28:45
8.0
9.0
✓10.0
15.0
29.0
canary
15.0
24.0
nightly
✓6.0
5.1
12.0
15.0
next
6.0
6.0
4.2
TAP version 13 # 3x3 ok 1 should be equivalent ok 2 should be equivalent ok 3 should be equivalent # known solutions ok 4 should be equal ok 5 should be equal # 3x3 ok 6 should be equivalent ok 7 should be equivalent ok 8 should be equivalent 1..8 # tests 8 # pass 8 # ok
TAP version 13 # 3x3 ok 1 should be equivalent ok 2 should be equivalent ok 3 should be equivalent # known solutions ok 4 should be equal ok 5 should be equal # 3x3 ok 6 should be equivalent ok 7 should be equivalent ok 8 should be equivalent 1..8 # tests 8 # pass 8 # ok
timeout waiting to hear back from iexplore/9.0
not ok 1 Error: Object doesn't support this property or method on line 5777
2014-05-29 19:53:38
8.0
9.0
✓10.0
15.0
29.0
canary
15.0
24.0
nightly
5.1
6.0
12.0
15.0
next
6.0
6.0
4.2
TAP version 13 # 3x3 ok 1 should be equivalent ok 2 should be equivalent ok 3 should be equivalent # known solutions ok 4 should be equal ok 5 should be equal # 3x3 ok 6 should be equivalent ok 7 should be equivalent ok 8 should be equivalent 1..8 # tests 8 # pass 8 # ok
timeout waiting to hear back from iexplore/9.0
not ok 1 Error: Object doesn't support this property or method on line 5759
2014-05-28 04:13:26
8.0
9.0
✓10.0
✓15.0
✓29.0
✓canary
✓15.0
✓24.0
✓nightly
5.1
6.0
✓12.0
✓15.0
✓next
6.0
6.0
4.2
timeout waiting to hear back from safari/6.0
not ok 1 Error: TypeError: 'undefined' is not a function
TAP version 13 # 3x3 ok 1 should be equivalent ok 2 should be equivalent ok 3 should be equivalent # 3x3 ok 4 should be equivalent ok 5 should be equivalent ok 6 should be equivalent 1..6 # tests 6 # pass 6 # ok
TAP version 13 # 3x3 ok 1 should be equivalent ok 2 should be equivalent ok 3 should be equivalent # 3x3 ok 4 should be equivalent ok 5 should be equivalent ok 6 should be equivalent 1..6 # tests 6 # pass 6 # ok
TAP version 13 # 3x3 ok 1 should be equivalent ok 2 should be equivalent ok 3 should be equivalent # 3x3 ok 4 should be equivalent ok 5 should be equivalent ok 6 should be equivalent 1..6 # tests 6 # pass 6 # ok
TAP version 13 # 3x3 ok 1 should be equivalent ok 2 should be equivalent ok 3 should be equivalent # 3x3 ok 4 should be equivalent ok 5 should be equivalent ok 6 should be equivalent 1..6 # tests 6 # pass 6 # ok
TAP version 13 # 3x3 ok 1 should be equivalent ok 2 should be equivalent ok 3 should be equivalent # 3x3 ok 4 should be equivalent ok 5 should be equivalent ok 6 should be equivalent 1..6 # tests 6 # pass 6 # ok
TAP version 13 # 3x3 ok 1 should be equivalent ok 2 should be equivalent ok 3 should be equivalent # 3x3 ok 4 should be equivalent ok 5 should be equivalent ok 6 should be equivalent 1..6 # tests 6 # pass 6 # ok
firefox/nightly
TAP version 13 # 3x3 ok 1 should be equivalent ok 2 should be equivalent ok 3 should be equivalent # 3x3 ok 4 should be equivalent ok 5 should be equivalent ok 6 should be equivalent 1..6 # tests 6 # pass 6 # ok
TAP version 13 # 3x3 ok 1 should be equivalent ok 2 should be equivalent ok 3 should be equivalent # 3x3 ok 4 should be equivalent ok 5 should be equivalent ok 6 should be equivalent 1..6 # tests 6 # pass 6 # ok
TAP version 13 # 3x3 ok 1 should be equivalent ok 2 should be equivalent ok 3 should be equivalent # 3x3 ok 4 should be equivalent ok 5 should be equivalent ok 6 should be equivalent 1..6 # tests 6 # pass 6 # ok
TAP version 13 # 3x3 ok 1 should be equivalent ok 2 should be equivalent ok 3 should be equivalent # 3x3 ok 4 should be equivalent ok 5 should be equivalent ok 6 should be equivalent 1..6 # tests 6 # pass 6 # ok
TAP version 13 # 3x3 not ok 1 ReferenceError: 'Float64Array' is undefined --- operator: error expected: undefined actual: { description: '\'Float64Array\' is undefined', message: '\'Float64Array\' is undefined', number: -2146823279 } ... not ok 2 plan != count --- operator: fail expected: 3 actual: 1 ... # 3x3 not ok 3 ReferenceError: 'Float64Array' is undefined --- operator: error expected: undefined actual: { description: '\'Float64Array\' is undefined', message: '\'Float64Array\' is undefined', number: -2146823279 } ... not ok 4 plan != count --- operator: fail expected: 3 actual: 1 ... 1..4 # tests 4 # pass 0 # fail 4
not ok 1 Error: Object doesn't support this property or method on line 5750
2014-05-28 01:23:39
2014-05-28 01:18:16
8.0
9.0
10.0
15.0
canary
29.0
✓15.0
✓24.0
✓nightly
5.1
6.0
✓12.0
✓15.0
✓next
6.0
6.0
4.2
timeout waiting to hear back from safari/6.0
not ok 1 Error: ReferenceError: Can't find variable: Float64Array
TAP version 13 # 3x3 ok 1 should be equivalent ok 2 should be equivalent ok 3 should be equivalent # 3x3 ok 4 should be equivalent ok 5 should be equivalent ok 6 should be equivalent 1..6 # tests 6 # pass 6 # ok
TAP version 13 # 3x3 ok 1 should be equivalent ok 2 should be equivalent ok 3 should be equivalent # 3x3 ok 4 should be equivalent ok 5 should be equivalent ok 6 should be equivalent 1..6 # tests 6 # pass 6 # ok
TAP version 13 # 3x3 ok 1 should be equivalent ok 2 should be equivalent ok 3 should be equivalent # 3x3 ok 4 should be equivalent ok 5 should be equivalent ok 6 should be equivalent 1..6 # tests 6 # pass 6 # ok
not ok 1 Error: Uncaught ReferenceError: Uint8ClampedArray is not defined on line 5567
not ok 1 Error: Uncaught ReferenceError: Uint8ClampedArray is not defined on line 5567
firefox/nightly
TAP version 13 # 3x3 ok 1 should be equivalent ok 2 should be equivalent ok 3 should be equivalent # 3x3 ok 4 should be equivalent ok 5 should be equivalent ok 6 should be equivalent 1..6 # tests 6 # pass 6 # ok
TAP version 13 # 3x3 ok 1 should be equivalent ok 2 should be equivalent ok 3 should be equivalent # 3x3 ok 4 should be equivalent ok 5 should be equivalent ok 6 should be equivalent 1..6 # tests 6 # pass 6 # ok
TAP version 13 # 3x3 ok 1 should be equivalent ok 2 should be equivalent ok 3 should be equivalent # 3x3 ok 4 should be equivalent ok 5 should be equivalent ok 6 should be equivalent 1..6 # tests 6 # pass 6 # ok
not ok 1 Error: 'Uint8ClampedArray' is undefined on line 5567
not ok 1 Error: 'Float64Array' is undefined on line 6934
not ok 1 Error: 'Float64Array' is undefined on line 5551