jhpoelen/eol-globi-js

2014-06-05 03:48:53
npm http GET https://registry.npmjs.org/browserify npm http 200 https://registry.npmjs.org/browserify npm http GET https://registry.npmjs.org/browserify/-/browserify-4.1.8.tgz npm http 200 https://registry.npmjs.org/browserify/-/browserify-4.1.8.tgz npm http GET https://registry.npmjs.org/browser-resolve npm http GET https://registry.npmjs.org/browser-pack npm http GET https://registry.npmjs.org/browserify-zlib npm http GET https://registry.npmjs.org/buffer npm http GET https://registry.npmjs.org/builtins npm http GET https://registry.npmjs.org/commondir/0.0.1 npm http GET https://registry.npmjs.org/concat-stream npm http GET https://registry.npmjs.org/console-browserify npm http GET https://registry.npmjs.org/constants-browserify npm http GET https://registry.npmjs.org/crypto-browserify npm http GET https://registry.npmjs.org/deep-equal npm http GET https://registry.npmjs.org/defined npm http GET https://registry.npmjs.org/deps-sort npm http GET https://registry.npmjs.org/derequire npm http GET https://registry.npmjs.org/domain-browser npm http GET https://registry.npmjs.org/duplexer npm http GET https://registry.npmjs.org/events npm http GET https://registry.npmjs.org/glob npm http GET https://registry.npmjs.org/http-browserify npm http GET https://registry.npmjs.org/https-browserify npm http GET https://registry.npmjs.org/inherits npm http GET https://registry.npmjs.org/insert-module-globals npm http GET https://registry.npmjs.org/module-deps npm http GET https://registry.npmjs.org/os-browserify npm http GET https://registry.npmjs.org/parents npm http GET https://registry.npmjs.org/path-browserify npm http GET https://registry.npmjs.org/punycode npm http GET https://registry.npmjs.org/querystring-es3 npm http GET https://registry.npmjs.org/readable-stream npm http GET https://registry.npmjs.org/resolve npm http GET https://registry.npmjs.org/shallow-copy/0.0.1 npm http GET https://registry.npmjs.org/shell-quote npm http GET https://registry.npmjs.org/stream-browserify npm http GET https://registry.npmjs.org/stream-combiner npm http GET https://registry.npmjs.org/string_decoder npm http GET https://registry.npmjs.org/subarg/0.0.1 npm http GET https://registry.npmjs.org/syntax-error npm http GET https://registry.npmjs.org/through2 npm http GET https://registry.npmjs.org/timers-browserify npm http GET https://registry.npmjs.org/tty-browserify npm http GET https://registry.npmjs.org/umd npm http GET https://registry.npmjs.org/url npm http GET https://registry.npmjs.org/util npm http GET https://registry.npmjs.org/vm-browserify npm http GET https://registry.npmjs.org/xtend npm http GET https://registry.npmjs.org/process npm http GET https://registry.npmjs.org/JSONStream npm http GET https://registry.npmjs.org/assert npm http 200 https://registry.npmjs.org/buffer npm http 200 https://registry.npmjs.org/browser-pack npm http GET https://registry.npmjs.org/buffer/-/buffer-2.3.2.tgz npm http GET https://registry.npmjs.org/browser-pack/-/browser-pack-2.0.1.tgz npm http 200 https://registry.npmjs.org/concat-stream npm http 200 https://registry.npmjs.org/console-browserify npm ERR! registry error parsing json npm http GET https://registry.npmjs.org/concat-stream/-/concat-stream-1.4.6.tgz npm http 200 https://registry.npmjs.org/builtins npm ERR! SyntaxError: Unexpected token < npm ERR! npm ERR! <?xml version="1.0" encoding="utf-8"?> npm ERR! <!DOCTYPE html PUBLIC "-//W3C//DTD XHTML 1.0 Strict//EN" npm ERR! "http://www.w3.org/TR/xhtml1/DTD/xhtml1-strict.dtd"> npm ERR! <html> npm ERR! <head> npm ERR! <title>200 OK</title> npm ERR! </head> npm ERR! <body> npm ERR! <h1>Error 200 OK</h1> npm ERR! <p>OK</p> npm ERR! <h3>Guru Meditation:</h3> npm ERR! <p>XID: 724829549</p> npm ERR! <hr> npm ERR! <p>Varnish cache server</p> npm ERR! </body> npm ERR! </html> npm ERR! npm ERR! at Object.parse (native) npm ERR! at RegClient.<anonymous> (/testling/bin/node-v0.10.24/lib/node_modules/npm/node_modules/npm-registry-client/lib/request.js:241:23) npm ERR! at Request.self.callback (/testling/bin/node-v0.10.24/lib/node_modules/npm/node_modules/request/request.js:123:22) npm ERR! at Request.EventEmitter.emit (events.js:98:17) npm ERR! at Request.<anonymous> (/testling/bin/node-v0.10.24/lib/node_modules/npm/node_modules/request/request.js:893:14) npm ERR! at Request.EventEmitter.emit (events.js:117:20) npm ERR! at IncomingMessage.<anonymous> (/testling/bin/node-v0.10.24/lib/node_modules/npm/node_modules/request/request.js:844:12) npm ERR! at IncomingMessage.EventEmitter.emit (events.js:117:20) npm ERR! at _stream_readable.js:920:16 npm ERR! at process._tickCallback (node.js:415:13) npm ERR! If you need help, you may report this *entire* log, npm ERR! including the npm and node versions, at: npm ERR! <http://github.com/isaacs/npm/issues> npm ERR! System Linux 2.6.35.4-rscloud npm ERR! command "/testling/bin/node-v0.10.24/bin/node" "/testling/bin/node-v0.10.24/bin/npm" "--cache=/home/jhpoelen/.npm/px2ysidwsstmwpu1" "install" "browserify" npm ERR! cwd /home/jhpoelen/repos/58ef4949f9c5dc69bf5ed4d74c6f8ce7d60ae808.1401936531999 npm ERR! node -v v0.10.24 npm ERR! npm -v 1.3.21 npm ERR! type unexpected_token npm http GET https://registry.npmjs.org/builtins/-/builtins-0.0.4.tgz npm http 200 https://registry.npmjs.org/commondir/0.0.1 npm http 200 https://registry.npmjs.org/crypto-browserify npm http 200 https://registry.npmjs.org/constants-browserify npm http 200 https://registry.npmjs.org/deep-equal npm http GET https://registry.npmjs.org/commondir/-/commondir-0.0.1.tgz npm http GET https://registry.npmjs.org/crypto-browserify/-/crypto-browserify-1.0.9.tgz npm http GET https://registry.npmjs.org/constants-browserify/-/constants-browserify-0.0.1.tgz npm http GET https://registry.npmjs.org/deep-equal/-/deep-equal-0.1.2.tgz npm http 200 https://registry.npmjs.org/browserify-zlib npm http 200 https://registry.npmjs.org/browser-pack/-/browser-pack-2.0.1.tgz npm http 200 https://registry.npmjs.org/buffer/-/buffer-2.3.2.tgz npm http 200 https://registry.npmjs.org/concat-stream/-/concat-stream-1.4.6.tgz npm http 200 https://registry.npmjs.org/browser-resolve npm http GET https://registry.npmjs.org/browserify-zlib/-/browserify-zlib-0.1.4.tgz npm http GET https://registry.npmjs.org/browser-resolve/-/browser-resolve-1.2.4.tgz npm http 200 https://registry.npmjs.org/crypto-browserify/-/crypto-browserify-1.0.9.tgz npm http 200 https://registry.npmjs.org/constants-browserify/-/constants-browserify-0.0.1.tgz npm http 200 https://registry.npmjs.org/deps-sort npm http 200 https://registry.npmjs.org/defined npm http 200 https://registry.npmjs.org/deep-equal/-/deep-equal-0.1.2.tgz npm http 200 https://registry.npmjs.org/builtins/-/builtins-0.0.4.tgz npm http 200 https://registry.npmjs.org/derequire npm http 200 https://registry.npmjs.org/domain-browser npm http 200 https://registry.npmjs.org/browserify-zlib/-/browserify-zlib-0.1.4.tgz npm http 200 https://registry.npmjs.org/commondir/-/commondir-0.0.1.tgz npm http 200 https://registry.npmjs.org/browser-resolve/-/browser-resolve-1.2.4.tgz npm http GET https://registry.npmjs.org/deps-sort/-/deps-sort-0.1.2.tgz npm http GET https://registry.npmjs.org/defined/-/defined-0.0.0.tgz npm http GET https://registry.npmjs.org/derequire/-/derequire-0.8.0.tgz npm http GET https://registry.npmjs.org/domain-browser/-/domain-browser-1.1.1.tgz npm http 200 https://registry.npmjs.org/glob npm http 200 https://registry.npmjs.org/http-browserify npm http 200 https://registry.npmjs.org/events npm http 200 https://registry.npmjs.org/duplexer npm http 200 https://registry.npmjs.org/https-browserify npm http 200 https://registry.npmjs.org/derequire/-/derequire-0.8.0.tgz npm http GET https://registry.npmjs.org/glob/-/glob-3.2.11.tgz npm http GET https://registry.npmjs.org/http-browserify/-/http-browserify-1.3.2.tgz npm http GET https://registry.npmjs.org/events/-/events-1.0.1.tgz npm http GET https://registry.npmjs.org/duplexer/-/duplexer-0.1.1.tgz npm http GET https://registry.npmjs.org/https-browserify/-/https-browserify-0.0.0.tgz npm http 200 https://registry.npmjs.org/inherits npm http 200 https://registry.npmjs.org/parents npm http 200 https://registry.npmjs.org/domain-browser/-/domain-browser-1.1.1.tgz npm http 200 https://registry.npmjs.org/deps-sort/-/deps-sort-0.1.2.tgz npm http 200 https://registry.npmjs.org/defined/-/defined-0.0.0.tgz npm http 200 https://registry.npmjs.org/glob/-/glob-3.2.11.tgz npm http 200 https://registry.npmjs.org/os-browserify npm http 200 https://registry.npmjs.org/module-deps npm http 200 https://registry.npmjs.org/http-browserify/-/http-browserify-1.3.2.tgz npm http 200 https://registry.npmjs.org/path-browserify npm http 200 https://registry.npmjs.org/events/-/events-1.0.1.tgz npm http GET https://registry.npmjs.org/inherits/-/inherits-2.0.1.tgz npm http GET https://registry.npmjs.org/parents/-/parents-0.0.2.tgz npm http 200 https://registry.npmjs.org/querystring-es3 npm http 200 https://registry.npmjs.org/insert-module-globals npm http 200 https://registry.npmjs.org/duplexer/-/duplexer-0.1.1.tgz npm http 200 https://registry.npmjs.org/https-browserify/-/https-browserify-0.0.0.tgz npm http 200 https://registry.npmjs.org/punycode npm http 200 https://registry.npmjs.org/resolve npm http 200 https://registry.npmjs.org/shallow-copy/0.0.1 npm http 200 https://registry.npmjs.org/inherits/-/inherits-2.0.1.tgz npm http GET https://registry.npmjs.org/os-browserify/-/os-browserify-0.1.2.tgz npm http GET https://registry.npmjs.org/module-deps/-/module-deps-2.1.2.tgz npm http 200 https://registry.npmjs.org/parents/-/parents-0.0.2.tgz npm http GET https://registry.npmjs.org/path-browserify/-/path-browserify-0.0.0.tgz npm http 200 https://registry.npmjs.org/stream-browserify npm http 200 https://registry.npmjs.org/readable-stream npm http 200 https://registry.npmjs.org/stream-combiner npm http 200 https://registry.npmjs.org/path-browserify/-/path-browserify-0.0.0.tgz npm http 200 https://registry.npmjs.org/os-browserify/-/os-browserify-0.1.2.tgz npm http 200 https://registry.npmjs.org/module-deps/-/module-deps-2.1.2.tgz npm http 200 https://registry.npmjs.org/string_decoder npm http GET https://registry.npmjs.org/querystring-es3/-/querystring-es3-0.2.1-0.tgz npm http GET https://registry.npmjs.org/insert-module-globals/-/insert-module-globals-6.0.0.tgz npm http GET https://registry.npmjs.org/punycode/-/punycode-1.2.4.tgz npm http 200 https://registry.npmjs.org/subarg/0.0.1 npm http GET https://registry.npmjs.org/resolve/-/resolve-0.6.3.tgz npm http 200 https://registry.npmjs.org/syntax-error npm http 200 https://registry.npmjs.org/insert-module-globals/-/insert-module-globals-6.0.0.tgz npm http GET https://registry.npmjs.org/shallow-copy/-/shallow-copy-0.0.1.tgz npm http 200 https://registry.npmjs.org/punycode/-/punycode-1.2.4.tgz npm http 200 https://registry.npmjs.org/shell-quote npm http 200 https://registry.npmjs.org/umd npm http 200 https://registry.npmjs.org/timers-browserify npm http 200 https://registry.npmjs.org/resolve/-/resolve-0.6.3.tgz npm http GET https://registry.npmjs.org/stream-browserify/-/stream-browserify-1.0.0.tgz npm http 200 https://registry.npmjs.org/through2 npm http GET https://registry.npmjs.org/readable-stream/-/readable-stream-1.0.27-1.tgz npm http 200 https://registry.npmjs.org/querystring-es3/-/querystring-es3-0.2.1-0.tgz npm http 200 https://registry.npmjs.org/shallow-copy/-/shallow-copy-0.0.1.tgz npm http GET https://registry.npmjs.org/stream-combiner/-/stream-combiner-0.0.4.tgz npm http 200 https://registry.npmjs.org/url npm http GET https://registry.npmjs.org/string_decoder/-/string_decoder-0.0.1.tgz npm http 200 https://registry.npmjs.org/util npm http 200 https://registry.npmjs.org/tty-browserify npm http 200 https://registry.npmjs.org/readable-stream/-/readable-stream-1.0.27-1.tgz npm http GET https://registry.npmjs.org/subarg/-/subarg-0.0.1.tgz npm http GET https://registry.npmjs.org/syntax-error/-/syntax-error-1.1.0.tgz npm http 200 https://registry.npmjs.org/stream-combiner/-/stream-combiner-0.0.4.tgz npm http 200 https://registry.npmjs.org/vm-browserify npm http 200 https://registry.npmjs.org/process npm http GET https://registry.npmjs.org/umd/-/umd-2.1.0.tgz npm http GET https://registry.npmjs.org/shell-quote/-/shell-quote-0.0.1.tgz npm http GET https://registry.npmjs.org/timers-browserify/-/timers-browserify-1.0.1.tgz npm http GET https://registry.npmjs.org/through2/-/through2-0.4.2.tgz npm http 200 https://registry.npmjs.org/xtend npm http 200 https://registry.npmjs.org/subarg/-/subarg-0.0.1.tgz npm http GET https://registry.npmjs.org/url/-/url-0.10.1.tgz npm http 200 https://registry.npmjs.org/stream-browserify/-/stream-browserify-1.0.0.tgz npm http GET https://registry.npmjs.org/util/-/util-0.10.3.tgz npm http 200 https://registry.npmjs.org/assert npm http 200 https://registry.npmjs.org/string_decoder/-/string_decoder-0.0.1.tgz npm http GET https://registry.npmjs.org/tty-browserify/-/tty-browserify-0.0.0.tgz npm http 200 https://registry.npmjs.org/syntax-error/-/syntax-error-1.1.0.tgz npm http 200 https://registry.npmjs.org/umd/-/umd-2.1.0.tgz npm http 200 https://registry.npmjs.org/shell-quote/-/shell-quote-0.0.1.tgz npm http 200 https://registry.npmjs.org/timers-browserify/-/timers-browserify-1.0.1.tgz npm http 200 https://registry.npmjs.org/JSONStream npm http 200 https://registry.npmjs.org/through2/-/through2-0.4.2.tgz npm http GET https://registry.npmjs.org/vm-browserify/-/vm-browserify-0.0.4.tgz npm http GET https://registry.npmjs.org/process/-/process-0.7.0.tgz npm http 200 https://registry.npmjs.org/util/-/util-0.10.3.tgz npm http 200 https://registry.npmjs.org/tty-browserify/-/tty-browserify-0.0.0.tgz npm http 200 https://registry.npmjs.org/url/-/url-0.10.1.tgz npm http GET https://registry.npmjs.org/xtend/-/xtend-3.0.0.tgz npm http 200 https://registry.npmjs.org/vm-browserify/-/vm-browserify-0.0.4.tgz npm http GET https://registry.npmjs.org/assert/-/assert-1.1.1.tgz npm http GET https://registry.npmjs.org/JSONStream/-/JSONStream-0.7.4.tgz npm http 200 https://registry.npmjs.org/process/-/process-0.7.0.tgz npm http 200 https://registry.npmjs.org/xtend/-/xtend-3.0.0.tgz npm http 200 https://registry.npmjs.org/assert/-/assert-1.1.1.tgz npm http 200 https://registry.npmjs.org/JSONStream/-/JSONStream-0.7.4.tgz npm ERR! npm ERR! Additional logging details can be found in: npm ERR! /home/jhpoelen/repos/58ef4949f9c5dc69bf5ed4d74c6f8ce7d60ae808.1401936531999/npm-debug.log npm ERR! not ok code 0 npm http GET https://registry.npmjs.org/globi-data npm http GET https://registry.npmjs.org/d3 npm http GET https://registry.npmjs.org/tape npm http 200 https://registry.npmjs.org/tape npm http 200 https://registry.npmjs.org/globi-data npm http GET https://registry.npmjs.org/tape/-/tape-1.0.4.tgz npm http GET https://registry.npmjs.org/globi-data/-/globi-data-0.0.21.tgz npm http 200 https://registry.npmjs.org/d3 npm http GET https://registry.npmjs.org/d3/-/d3-3.2.8.tgz npm http 200 https://registry.npmjs.org/tape/-/tape-1.0.4.tgz npm http 200 https://registry.npmjs.org/d3/-/d3-3.2.8.tgz npm http 200 https://registry.npmjs.org/globi-data/-/globi-data-0.0.21.tgz npm http GET https://registry.npmjs.org/jsonify npm http GET https://registry.npmjs.org/through npm http GET https://registry.npmjs.org/deep-equal npm http GET https://registry.npmjs.org/defined npm http 200 https://registry.npmjs.org/jsonify npm http GET https://registry.npmjs.org/jsonify/-/jsonify-0.0.0.tgz npm http 304 https://registry.npmjs.org/deep-equal npm http GET https://registry.npmjs.org/deep-equal/-/deep-equal-0.0.0.tgz npm http 200 https://registry.npmjs.org/through npm http GET https://registry.npmjs.org/through/-/through-2.3.4.tgz npm http 304 https://registry.npmjs.org/defined npm http 200 https://registry.npmjs.org/jsonify/-/jsonify-0.0.0.tgz npm http 200 https://registry.npmjs.org/deep-equal/-/deep-equal-0.0.0.tgz npm http 200 https://registry.npmjs.org/through/-/through-2.3.4.tgz npm http GET https://registry.npmjs.org/xmlhttprequest npm http 200 https://registry.npmjs.org/xmlhttprequest npm http GET https://registry.npmjs.org/xmlhttprequest/-/xmlhttprequest-1.6.0.tgz npm http 200 https://registry.npmjs.org/xmlhttprequest/-/xmlhttprequest-1.6.0.tgz npm http GET https://registry.npmjs.org/jsdom npm http 200 https://registry.npmjs.org/jsdom npm http GET https://registry.npmjs.org/jsdom/-/jsdom-0.5.7.tgz npm http 200 https://registry.npmjs.org/jsdom/-/jsdom-0.5.7.tgz npm http GET https://registry.npmjs.org/request npm http GET https://registry.npmjs.org/htmlparser npm http GET https://registry.npmjs.org/nwmatcher npm http GET https://registry.npmjs.org/cssom npm http GET https://registry.npmjs.org/cssstyle npm http GET https://registry.npmjs.org/contextify npm http 200 https://registry.npmjs.org/cssom npm http 200 https://registry.npmjs.org/request npm http 200 https://registry.npmjs.org/nwmatcher npm http GET https://registry.npmjs.org/cssom/-/cssom-0.2.5.tgz npm http 200 https://registry.npmjs.org/htmlparser npm http GET https://registry.npmjs.org/request/-/request-2.36.0.tgz npm http GET https://registry.npmjs.org/nwmatcher/-/nwmatcher-1.3.3.tgz npm http GET https://registry.npmjs.org/htmlparser/-/htmlparser-1.7.7.tgz npm http 200 https://registry.npmjs.org/cssstyle npm http 200 https://registry.npmjs.org/request/-/request-2.36.0.tgz npm http GET https://registry.npmjs.org/cssstyle/-/cssstyle-0.2.14.tgz npm http 200 https://registry.npmjs.org/cssom/-/cssom-0.2.5.tgz npm http 200 https://registry.npmjs.org/nwmatcher/-/nwmatcher-1.3.3.tgz npm http 200 https://registry.npmjs.org/htmlparser/-/htmlparser-1.7.7.tgz npm http 200 https://registry.npmjs.org/contextify npm http GET https://registry.npmjs.org/contextify/-/contextify-0.1.8.tgz npm http 200 https://registry.npmjs.org/cssstyle/-/cssstyle-0.2.14.tgz npm http 200 https://registry.npmjs.org/contextify/-/contextify-0.1.8.tgz npm http GET https://registry.npmjs.org/nan npm http GET https://registry.npmjs.org/bindings npm http 200 https://registry.npmjs.org/nan npm http 200 https://registry.npmjs.org/bindings npm http GET https://registry.npmjs.org/nan/-/nan-1.0.0.tgz npm http GET https://registry.npmjs.org/bindings/-/bindings-1.2.0.tgz npm http 200 https://registry.npmjs.org/bindings/-/bindings-1.2.0.tgz npm http GET https://registry.npmjs.org/mime npm http GET https://registry.npmjs.org/node-uuid npm http GET https://registry.npmjs.org/forever-agent npm http GET https://registry.npmjs.org/tough-cookie npm http GET https://registry.npmjs.org/form-data npm http GET https://registry.npmjs.org/tunnel-agent npm http GET https://registry.npmjs.org/http-signature npm http GET https://registry.npmjs.org/oauth-sign npm http GET https://registry.npmjs.org/hawk npm http GET https://registry.npmjs.org/aws-sign2 npm http GET https://registry.npmjs.org/qs npm http GET https://registry.npmjs.org/json-stringify-safe npm http 200 https://registry.npmjs.org/mime npm http 200 https://registry.npmjs.org/tunnel-agent npm http 200 https://registry.npmjs.org/node-uuid npm http 200 https://registry.npmjs.org/nan/-/nan-1.0.0.tgz npm http GET https://registry.npmjs.org/mime/-/mime-1.2.11.tgz npm http 200 https://registry.npmjs.org/http-signature npm http 200 https://registry.npmjs.org/oauth-sign npm http GET https://registry.npmjs.org/tunnel-agent/-/tunnel-agent-0.4.0.tgz npm http GET https://registry.npmjs.org/node-uuid/-/node-uuid-1.4.1.tgz npm http 200 https://registry.npmjs.org/aws-sign2 npm http GET https://registry.npmjs.org/http-signature/-/http-signature-0.10.0.tgz npm http GET https://registry.npmjs.org/oauth-sign/-/oauth-sign-0.3.0.tgz npm http 200 https://registry.npmjs.org/forever-agent npm http 200 https://registry.npmjs.org/qs npm http 200 https://registry.npmjs.org/http-signature/-/http-signature-0.10.0.tgz npm http GET https://registry.npmjs.org/aws-sign2/-/aws-sign2-0.5.0.tgz npm http GET https://registry.npmjs.org/forever-agent/-/forever-agent-0.5.2.tgz npm http 200 https://registry.npmjs.org/hawk npm http 200 https://registry.npmjs.org/json-stringify-safe npm http 200 https://registry.npmjs.org/mime/-/mime-1.2.11.tgz npm http GET https://registry.npmjs.org/qs/-/qs-0.6.6.tgz npm http 200 https://registry.npmjs.org/tunnel-agent/-/tunnel-agent-0.4.0.tgz npm http 200 https://registry.npmjs.org/node-uuid/-/node-uuid-1.4.1.tgz npm http 200 https://registry.npmjs.org/form-data npm http GET https://registry.npmjs.org/hawk/-/hawk-1.0.0.tgz npm http GET https://registry.npmjs.org/json-stringify-safe/-/json-stringify-safe-5.0.0.tgz npm http 200 https://registry.npmjs.org/oauth-sign/-/oauth-sign-0.3.0.tgz npm http 200 https://registry.npmjs.org/forever-agent/-/forever-agent-0.5.2.tgz npm http 200 https://registry.npmjs.org/qs/-/qs-0.6.6.tgz npm http 200 https://registry.npmjs.org/hawk/-/hawk-1.0.0.tgz npm http 200 https://registry.npmjs.org/json-stringify-safe/-/json-stringify-safe-5.0.0.tgz npm http GET https://registry.npmjs.org/form-data/-/form-data-0.1.3.tgz npm http 200 https://registry.npmjs.org/aws-sign2/-/aws-sign2-0.5.0.tgz npm http 200 https://registry.npmjs.org/tough-cookie npm http GET https://registry.npmjs.org/tough-cookie/-/tough-cookie-0.12.1.tgz npm http 200 https://registry.npmjs.org/form-data/-/form-data-0.1.3.tgz npm http 200 https://registry.npmjs.org/tough-cookie/-/tough-cookie-0.12.1.tgz > contextify@0.1.8 install /home/jhpoelen/repos/58ef4949f9c5dc69bf5ed4d74c6f8ce7d60ae808.1401936531999/node_modules/d3/node_modules/jsdom/node_modules/contextify > node-gyp rebuild gyp http GET http://nodejs.org/dist/v0.10.24/node-v0.10.24.tar.gz gyp http 200 http://nodejs.org/dist/v0.10.24/node-v0.10.24.tar.gz Traceback (most recent call last): File "/testling/bin/node-v0.10.24/lib/node_modules/npm/node_modules/node-gyp/gyp/gyp_main.py", line 18, in <module> sys.exit(gyp.script_main()) File "/testling/bin/node-v0.10.24/lib/node_modules/npm/node_modules/node-gyp/gyp/pylib/gyp/__init__.py", line 534, in script_main return main(sys.argv[1:]) File "/testling/bin/node-v0.10.24/lib/node_modules/npm/node_modules/node-gyp/gyp/pylib/gyp/__init__.py", line 527, in main return gyp_main(args) File "/testling/bin/node-v0.10.24/lib/node_modules/npm/node_modules/node-gyp/gyp/pylib/gyp/__init__.py", line 503, in gyp_main options.circular_check) File "/testling/bin/node-v0.10.24/lib/node_modules/npm/node_modules/node-gyp/gyp/pylib/gyp/__init__.py", line 129, in Load params['parallel'], params['root_targets']) File "/testling/bin/node-v0.10.24/lib/node_modules/npm/node_modules/node-gyp/gyp/pylib/gyp/input.py", line 2687, in Load generator_input_info) File "/testling/bin/node-v0.10.24/lib/node_modules/npm/node_modules/node-gyp/gyp/pylib/gyp/input.py", line 594, in LoadTargetBuildFilesParallel parallel_state.pool = multiprocessing.Pool(8) File "/testling/bin/python-2.7.3/lib/python2.7/multiprocessing/__init__.py", line 232, in Pool return Pool(processes, initializer, initargs, maxtasksperchild) File "/testling/bin/python-2.7.3/lib/python2.7/multiprocessing/pool.py", line 115, in __init__ self._setup_queues() File "/testling/bin/python-2.7.3/lib/python2.7/multiprocessing/pool.py", line 210, in _setup_queues self._inqueue = SimpleQueue() File "/testling/bin/python-2.7.3/lib/python2.7/multiprocessing/queues.py", line 352, in __init__ self._rlock = Lock() File "/testling/bin/python-2.7.3/lib/python2.7/multiprocessing/synchronize.py", line 147, in __init__ SemLock.__init__(self, SEMAPHORE, 1, 1) File "/testling/bin/python-2.7.3/lib/python2.7/multiprocessing/synchronize.py", line 75, in __init__ sl = self._semlock = _multiprocessing.SemLock(kind, value, maxvalue) OSError: [Errno 38] Function not implemented gyp ERR! configure error gyp ERR! stack Error: `gyp` failed with exit code: 1 gyp ERR! stack at ChildProcess.onCpExit (/testling/bin/node-v0.10.24/lib/node_modules/npm/node_modules/node-gyp/lib/configure.js:337:16) gyp ERR! stack at ChildProcess.EventEmitter.emit (events.js:98:17) gyp ERR! stack at Process.ChildProcess._handle.onexit (child_process.js:789:12) gyp ERR! System Linux 2.6.35.4-rscloud gyp ERR! command "node" "/testling/bin/node-v0.10.24/lib/node_modules/npm/node_modules/node-gyp/bin/node-gyp.js" "rebuild" gyp ERR! cwd /home/jhpoelen/repos/58ef4949f9c5dc69bf5ed4d74c6f8ce7d60ae808.1401936531999/node_modules/d3/node_modules/jsdom/node_modules/contextify gyp ERR! node -v v0.10.24 gyp ERR! node-gyp -v v0.12.1 gyp ERR! not ok npm http GET https://registry.npmjs.org/combined-stream npm http GET https://registry.npmjs.org/async npm http GET https://registry.npmjs.org/assert-plus/0.1.2 npm http GET https://registry.npmjs.org/asn1/0.1.11 npm http GET https://registry.npmjs.org/ctype/0.5.2 npm http 200 https://registry.npmjs.org/assert-plus/0.1.2 npm http GET https://registry.npmjs.org/assert-plus/-/assert-plus-0.1.2.tgz npm http 200 https://registry.npmjs.org/combined-stream npm http GET https://registry.npmjs.org/combined-stream/-/combined-stream-0.0.4.tgz npm http 200 https://registry.npmjs.org/asn1/0.1.11 npm http 200 https://registry.npmjs.org/ctype/0.5.2 npm http GET https://registry.npmjs.org/asn1/-/asn1-0.1.11.tgz npm http GET https://registry.npmjs.org/ctype/-/ctype-0.5.2.tgz npm http 200 https://registry.npmjs.org/assert-plus/-/assert-plus-0.1.2.tgz npm http 200 https://registry.npmjs.org/ctype/-/ctype-0.5.2.tgz npm http 200 https://registry.npmjs.org/async npm http 200 https://registry.npmjs.org/combined-stream/-/combined-stream-0.0.4.tgz npm http GET https://registry.npmjs.org/async/-/async-0.9.0.tgz npm http 200 https://registry.npmjs.org/async/-/async-0.9.0.tgz npm http 200 https://registry.npmjs.org/asn1/-/asn1-0.1.11.tgz npm http GET https://registry.npmjs.org/punycode npm http 304 https://registry.npmjs.org/punycode npm http GET https://registry.npmjs.org/cssom/-/cssom-0.3.0.tgz npm http GET https://registry.npmjs.org/cryptiles npm http GET https://registry.npmjs.org/sntp npm http GET https://registry.npmjs.org/hoek npm http GET https://registry.npmjs.org/boom npm http 200 https://registry.npmjs.org/boom npm http 200 https://registry.npmjs.org/cssom/-/cssom-0.3.0.tgz npm http 200 https://registry.npmjs.org/hoek npm http GET https://registry.npmjs.org/boom/-/boom-0.4.2.tgz npm http GET https://registry.npmjs.org/hoek/-/hoek-0.9.1.tgz npm http 200 https://registry.npmjs.org/boom/-/boom-0.4.2.tgz npm http 200 https://registry.npmjs.org/cryptiles npm http 200 https://registry.npmjs.org/sntp npm http GET https://registry.npmjs.org/cryptiles/-/cryptiles-0.2.2.tgz npm http GET https://registry.npmjs.org/sntp/-/sntp-0.2.4.tgz npm http 200 https://registry.npmjs.org/hoek/-/hoek-0.9.1.tgz npm http 200 https://registry.npmjs.org/cryptiles/-/cryptiles-0.2.2.tgz npm http 200 https://registry.npmjs.org/sntp/-/sntp-0.2.4.tgz npm http GET https://registry.npmjs.org/delayed-stream/0.0.5 npm http 200 https://registry.npmjs.org/delayed-stream/0.0.5 npm ERR! registry error parsing json npm WARN optional dep failed, continuing form-data@0.1.3 npm ERR! contextify@0.1.8 install: `node-gyp rebuild` npm ERR! Exit status 1 npm ERR! npm ERR! Failed at the contextify@0.1.8 install script. npm ERR! This is most likely a problem with the contextify package, npm ERR! not with npm itself. npm ERR! Tell the author that this fails on your system: npm ERR! node-gyp rebuild npm ERR! You can get their info via: npm ERR! npm owner ls contextify npm ERR! There is likely additional logging output above. npm ERR! System Linux 2.6.35.4-rscloud npm ERR! command "/testling/bin/node-v0.10.24/bin/node" "/testling/bin/node-v0.10.24/bin/npm" "--cache=/home/jhpoelen/.npm/px2ysidwsstmwpu1" "install" "." npm ERR! cwd /home/jhpoelen/repos/58ef4949f9c5dc69bf5ed4d74c6f8ce7d60ae808.1401936531999 npm ERR! node -v v0.10.24 npm ERR! npm -v 1.3.21 npm ERR! code ELIFECYCLE npm ERR! npm ERR! Additional logging details can be found in: npm ERR! /home/jhpoelen/repos/58ef4949f9c5dc69bf5ed4d74c6f8ce7d60ae808.1401936531999/npm-debug.log npm ERR! not ok code 0 timeout: failed to run command 'browserify': No such file or directory * preprocessing command exit code 127 *
2014-04-19 00:43:54
2014-01-10 22:02:35
2014-01-10 19:56:52
2014-01-10 19:11:27
2014-01-03 00:58:51
2013-11-07 20:14:01
8.0
9.0
✓20.0
✓13.0
TAP version 13 # my first dom test ok 1 should be equal ok 2 should be equal ok 3 should be equal # check interaction graph insertion ok 4 (unnamed assert) ok 5 (unnamed assert) found [216] interactions ok 6 (unnamed assert) # render taxon info box ok 7 (unnamed assert) ok 8 (unnamed assert) # my first test ok 9 should be equal 1..9 # tests 9 # pass 9 # ok
TAP version 13 # my first dom test ok 1 should be equal ok 2 should be equal ok 3 should be equal # check interaction graph insertion ok 4 (unnamed assert) ok 5 (unnamed assert) found [216] interactions ok 6 (unnamed assert) # render taxon info box ok 7 (unnamed assert) ok 8 (unnamed assert) # my first test ok 9 should be equal 1..9 # tests 9 # pass 9 # ok
TAP version 13 # my first dom test ok 1 should be equal ok 2 should be equal ok 3 should be equal # check interaction graph insertion not ok 4 Error: Access is denied. --- operator: error expected: actual: {"message":"Access is denied.\r\n","description":"Access is denied.\r\n","number":-2147024891} ... # render taxon info box not ok 5 Error: Access is denied. --- operator: error expected: actual: {"message":"Access is denied.\r\n","description":"Access is denied.\r\n","number":-2147024891} ... # my first test ok 6 should be equal not ok 7 plan != count --- operator: fail expected: 2 actual: 1 ... not ok 8 plan != count --- operator: fail expected: 3 actual: 1 ... 1..8 # tests 8 # pass 4 # fail 4
idle timeout: 30 seconds with no output
2013-11-01 05:45:00
8.0
9.0
✓20.0
13.0
TAP version 13 # my first dom test ok 1 should be equal ok 2 should be equal ok 3 should be equal # check interaction graph insertion ok 4 (unnamed assert) ok 5 (unnamed assert) found [194] interactions ok 6 (unnamed assert) # render taxon info box ok 7 (unnamed assert) ok 8 (unnamed assert) # my first test ok 9 should be equal 1..9 # tests 9 # pass 9 # ok
TAP version 13 # my first dom test ok 1 should be equal ok 2 should be equal ok 3 should be equal # check interaction graph insertion not ok 4 Error: Access is denied. --- operator: error expected: actual: {"message":"Access is denied.\r\n","description":"Access is denied.\r\n","number":-2147024891} ... # render taxon info box not ok 5 Error: Access is denied. --- operator: error expected: actual: {"message":"Access is denied.\r\n","description":"Access is denied.\r\n","number":-2147024891} ... # my first test ok 6 should be equal not ok 7 plan != count --- operator: fail expected: 2 actual: 1 ... not ok 8 plan != count --- operator: fail expected: 3 actual: 1 ... 1..8 # tests 8 # pass 4 # fail 4
timeout waiting to hear back from iexplore/8.0
2013-11-01 03:21:58
8.0
9.0
✓20.0
13.0
TAP version 13 # my first dom test ok 1 should be equal ok 2 should be equal ok 3 should be equal # check interaction graph insertion ok 4 (unnamed assert) ok 5 (unnamed assert) requesting [http://trophicgraph.com:8080/interaction?type=json.v2&nw_lat=41.574361&nw_lng=-125.533448&se_lat=32.750323&se_lng=-114.744873&] ok 6 (unnamed assert) # render taxon info box requesting taxon image data from: [http://trophicgraph.com:8080/imagesForName/Ariopsis%20felis] ok 7 (unnamed assert) received some data [{"thumbnailURL":null,"imageURL":null,"infoURL":"http://eol.org/pages/223038","eolpageId":"223038","scientificName":"Ariopsis felis","commonName":"Hardhead Catfish"}] ok 8 (unnamed assert) clicked on [Ariopsis felis] # my first test ok 9 should be equal 1..9 # tests 9 # pass 9 # ok
TAP version 13 # my first dom test ok 1 should be equal ok 2 should be equal ok 3 should be equal # check interaction graph insertion not ok 4 Error: Access is denied. --- operator: error expected: actual: {"message":"Access is denied.\r\n","description":"Access is denied.\r\n","number":-2147024891} ... # render taxon info box requesting taxon image data from: [http://trophicgraph.com:8080/imagesForName/Ariopsis%20felis] not ok 5 Error: Access is denied. --- operator: error expected: actual: {"message":"Access is denied.\r\n","description":"Access is denied.\r\n","number":-2147024891} ... # my first test ok 6 should be equal not ok 7 plan != count --- operator: fail expected: 2 actual: 1 ... not ok 8 plan != count --- operator: fail expected: 3 actual: 1 ... 1..8 # tests 8 # pass 4 # fail 4
timeout waiting to hear back from iexplore/8.0
2013-11-01 03:25:53
8.0
9.0
✓20.0
13.0
TAP version 13 # my first dom test ok 1 should be equal ok 2 should be equal ok 3 should be equal # check interaction graph insertion ok 4 (unnamed assert) ok 5 (unnamed assert) requesting [http://trophicgraph.com:8080/interaction?type=json.v2&nw_lat=41.574361&nw_lng=-125.533448&se_lat=32.750323&se_lng=-114.744873&] ok 6 (unnamed assert) # render taxon info box requesting taxon image data from: [http://trophicgraph.com:8080/imagesForName/Ariopsis%20felis] ok 7 (unnamed assert) received some data [{"thumbnailURL":null,"imageURL":null,"infoURL":"http://eol.org/pages/223038","eolpageId":"223038","scientificName":"Ariopsis felis","commonName":"Hardhead Catfish"}] ok 8 (unnamed assert) clicked on [Ariopsis felis] # my first test ok 9 should be equal 1..9 # tests 9 # pass 9 # ok
timeout waiting to hear back from iexplore/8.0
2013-10-31 23:10:55
2013-10-31 22:56:22
2013-10-31 22:55:51
2013-08-21 22:14:42
2013-08-20 23:28:23
2013-08-17 00:10:21
2013-08-17 00:07:00
2013-08-16 23:54:51
2013-08-16 23:39:47
2013-08-16 23:32:38
2013-08-16 21:53:52
2013-08-16 07:01:18
2013-08-16 06:57:04
2013-08-16 06:35:34
2013-08-12 12:55:28
2013-08-11 21:04:06
2013-08-09 05:56:36
2013-08-09 04:49:27
2013-08-08 12:49:02
2013-08-08 12:47:52
2013-08-05 22:04:33
2013-08-05 21:57:17
2013-08-05 21:56:57
2013-08-05 20:08:52
2013-08-05 19:08:09
8.0
✓9.0
✓20.0
✓13.0
TAP version 13 # my first test ok 1 should be equal 1..1 # tests 1 # pass 1 # ok
TAP version 13 # my first test ok 1 should be equal 1..1 # tests 1 # pass 1 # ok
iexplore/9.0